BDBM50100069 CHEMBL287320::Naphthalene-1-carboxylic acid [(S)-1-[4-(3,4-dihydro-1H-isoquinoline-2-carbonyl)-thiazol-2-yl]-2-(4-nitro-phenyl)-ethyl]-amide
SMILES [O-][N+](=O)c1ccc(C[C@H](NC(=O)c2cccc3ccccc23)c2nc(cs2)C(=O)N2CCc3ccccc3C2)cc1
InChI Key InChIKey=INTSHLCZQVTJSM-NDEPHWFRSA-N
Data  1 IC50
  Tab Delimited (TSV)   2D SDfile   Computed 3D by Vconf -m prep SDfile
Find this compound or compounds like it in BindingDB:
Activity Spreadsheet -- Enzyme Inhibition Constant Data from BindingDB
Found 1 hit for monomerid = 50100069
TargetC-C chemokine receptor type 3(Homo sapiens (Human))
Smithkline Beecham Pharmaceuticals
Curated by ChEMBL
LigandPNGBDBM50100069(CHEMBL287320 | Naphthalene-1-carboxylic acid [(S)-...)
Affinity DataIC50:  1.25E+4nM. Assay description: Antagonist activity against C-C chemokine receptor type 3
In DepthDetails ArticlePubMed